{"text_format":"2","workbook":"xlsx","n_sheets":4,"sheets":["Listado","Auxiliar","Desplegables","Hoja1"],"not_rendered":{"charts":0,"images":3,"macros":0,"external_links":2,"defined_names":42,"comments":0,"pivot_tables":0},"unopened":[],"bounds":{"document_bytes":16777216,"sheet_cells":100000,"run_cost":"one","rows_first":2000,"rows_last":500,"rows_between":2000,"halvings":0,"cell_chars":16384,"cell_head_chars":4096},"cells_cut":0,"cells_raw":0,"read":"whole","date_system":"1900"}

{"sheet":"Listado","index":0,"n_rows":6,"n_cols":7,"rows_kept":6,"cut":false,"hidden":false,"merged":[[4,0,4,6]]}
[]
["EXPEDIENTE","BENEFICIARIO","NIF","CÓDIGO HERRAMIENTA GESTIÓN SUBVENCIONES","ID ACCIÓN FORMATIVA","DENOMINACIÓN ACCIÓN FORMATIVA","Nº EDICIÓN"]
[null,{"$f":"IFERROR(VLOOKUP($A$3,Auxiliar!$A$2:$B$23,2,0),\"\")","v":""},{"$f":"IFERROR(VLOOKUP(A3,Auxiliar!$BA$2:$BB$23,2,0),\"\")","v":""},null,{"$f":"IFERROR(VLOOKUP(D3,Auxiliar!$BK$2:$BL$220,2,0),\"\")","v":""},{"$f":"IFERROR(VLOOKUP(D3,Auxiliar!$BE$2:$BF$220,2,0),\"\")","v":""}]
[]
["LISTADO DE ACTIVIDADES CONCERTADAS CON TERCEROS"]
["Nombre o Razón Social de la Empresa","NIF de la empresa","Importe (con IVA)","Objeto del contrato","Fecha inicio contrato","Fecha fin contrato","¿Se considera subcontratación a efectos del artículo 29.1 de la Ley General de Subvenciones?"]

{"sheet":"Auxiliar","index":1,"n_rows":220,"n_cols":64,"rows_kept":220,"cut":false,"hidden":true,"merged":[]}
[{"$nulls":23},"Código ficha resumen","Id Acción Formativa","Número de Edición","Denominación Acción Formativa","Código herramienta gestión subvenciones","Número de créditos ECTS",null,null,null,1,2,3,4,5,6,7,null,null,null,"Expediente","Beneficiario","Id Acción Formativa","Número de Edición","Denominación Acción Formativa","Código herramienta gestión subvenciones","Código ficha resumen","Subvención concedida (por AF)","Subvención concedida por Edición",null,"Expediente","NIF"]
["C19_PR/22/00006","CENTRO DE ENSEÑANZA UNIVERSITARIA SEK","C19_PR/22/00006",{"$nulls":20},"C19_PR/22/00006-P01_L1_C19-20221014-1","AF01",1,"Logística urbana inteligente de mercancías","C19_PR/22/00006-P01_L1_C19-20221014-1",15,null,null,"C19_PR/22/00006","C19_PR/22/00006-P01_L1_C19-20221014-1","C19_PR/22/00006-P02_L1_C19-20221031-1","C19_PR/22/00006-P03_L1_C19-20221102-1","","","","",null,null,null,"C19_PR/22/00006","CENTRO DE ENSEÑANZA UNIVERSITARIA SEK","AF01",1,"Logística urbana inteligente de mercancías","C19_PR/22/00006-P01_L1_C19-20221014-1","AF1",750000,50000,null,"C19_PR/22/00006","A79336947",null,null,"C19_PR/22/00006-P01_L1_C19-20221014-1","Logística urbana inteligente de mercancías",{"$nulls":4},"C19_PR/22/00006-P01_L1_C19-20221014-1","AF01"]
["C19_PR/22/00007","UNIVERSIDADE DE VIGO","C19_PR/22/00007",null,null,"CENTRO DE ENSEÑANZA UNIVERSITARIA SEK",null,"CENTRO DE ENSEÑANZA UNIVERSITARIA SEK","UNIVERSIDADE DE VIGO","UNIVERSIDAD DE CANTABRIA","UNIVERSIDAD DE ALCALA DE HENÁRES","UNIVERSITAT POLITÈCNICA DE CATALUNYA","UNIVERSIDAD DEL PAÍS VASCO_EUSKAL HERRIKO UNIBERTSITATEA","UNIVERSIDAD AUTÓNOMA DE MADRID","UNIVERSIDAD DE CASTILLA LA MANCHA","UNIVERSIDAD POLITÉCNICA DE CARTAGENA","UNIVERSIDAD NACIONAL DE EDUCACIÓN A DISTANCIA","UNIVERSIDAD POLITÉCNICA DE MADRID","UNIVERSIDAD DE LA LAGUNA","UNIVERSIDAD DE CORDOBA","UNIVERSIDAD DE HUELVA","UNIVERSIDAD DE MURCIA","UNIVERSIDAD INTERNACIONAL ISABEL I DE CASTILLA","C19_PR/22/00006-P01_L1_C19-20221014-1","AF01",2,"Logística urbana inteligente de mercancías","C19_PR/22/00006-P01_L1_C19-20221014-1",15,null,null,"C19_PR/22/00007","C19_PR/22/00007-P01_L1_C19-20221103-1","C19_PR/22/00007-P02_L1_C19-20221103-1","C19_PR/22/00007-P03_L1_C19-20221103-1","C19_PR/22/00007-P04_L1_C19-20221103-1","","","",null,null,null,"C19_PR/22/00006","CENTRO DE ENSEÑANZA UNIVERSITARIA SEK","AF01",2,"Logística urbana inteligente de mercancías","C19_PR/22/00006-P01_L1_C19-20221014-1","AF1",750000,50000,null,"C19_PR/22/00011","Q2818018J",null,null,"C19_PR/22/00006-P01_L1_C19-20221014-1","Logística urbana inteligente de mercancías",{"$nulls":4},"C19_PR/22/00006-P01_L1_C19-20221014-1","AF01"]
["C19_PR/22/00009","UNIVERSIDAD DE CANTABRIA","C19_PR/22/00009",null,null,"UNIVERSIDADE DE VIGO",null,"C19_PR/22/00006","C19_PR/22/00007","C19_PR/22/00009","C19_PR/22/00011","C19_PR/22/00014","C19_PR/22/00016","C19_PR/22/00018","C19_PR/22/00020","C19_PR/22/00022","C19_PR/22/00023","C19_PR/22/00024","C19_PR/22/00027","C19_PR/22/00029","C19_PR/22/00035","C19_PR/22/00036","C19_PR/22/00041","C19_PR/22/00006-P01_L1_C19-20221014-1","AF01",3,"Logística urbana inteligente de mercancías","C19_PR/22/00006-P01_L1_C19-20221014-1",15,null,null,"C19_PR/22/00009","C19_PR/22/00009-P04_L1_C19-20221102-1","","","","","","",null,null,null,"C19_PR/22/00006","CENTRO DE ENSEÑANZA UNIVERSITARIA SEK","AF01",3,"Logística urbana inteligente de mercancías","C19_PR/22/00006-P01_L1_C19-20221014-1","AF1",750000,50000,null,"C19_PR/22/00020","Q1368009E",null,null,"C19_PR/22/00006-P01_L1_C19-20221014-1","Logística urbana inteligente de mercancías",{"$nulls":4},"C19_PR/22/00006-P01_L1_C19-20221014-1","AF01"]
["C19_PR/22/00011","UNIVERSIDAD DE ALCALA DE HENÁRES","C19_PR/22/00011",null,null,"UNIVERSIDAD DE CANTABRIA",null,null,"C19_PR/22/00038","C19_PR/22/00028",null,"C19_PR/22/00039",{"$nulls":5},"C19_PR/22/00026",{"$nulls":5},"C19_PR/22/00006-P01_L1_C19-20221014-1","AF01",4,"Logística urbana inteligente de mercancías","C19_PR/22/00006-P01_L1_C19-20221014-1",15,null,null,"C19_PR/22/00011","C19_PR/22/00011-P01_L1_C19-20221026-1","C19_PR/22/00011-P02_L1_C19-20221102-1","C19_PR/22/00011-P03_L1_C19-20221102-1","C19_PR/22/00011-P05_L1_C19-20221103-1","","","",null,null,null,"C19_PR/22/00006","CENTRO DE ENSEÑANZA UNIVERSITARIA SEK","AF01",4,"Logística urbana inteligente de mercancías","C19_PR/22/00006-P01_L1_C19-20221014-1","AF1",750000,50000,null,"C19_PR/22/00007","Q8650002B",null,null,"C19_PR/22/00006-P01_L1_C19-20221014-1","Logística urbana inteligente de mercancías",{"$nulls":4},"C19_PR/22/00006-P01_L1_C19-20221014-1","AF01"]
["C19_PR/22/00014","UNIVERSITAT POLITÈCNICA DE CATALUNYA","C19_PR/22/00014",null,null,"UNIVERSIDAD DE ALCALA DE HENÁRES",{"$nulls":5},"C19_PR/22/00040",{"$nulls":11},"C19_PR/22/00006-P01_L1_C19-20221014-1","AF01",5,"Logística urbana inteligente de mercancías","C19_PR/22/00006-P01_L1_C19-20221014-1",15,null,null,"C19_PR/22/00014","C19_PR/22/00014-P01_L1_C19-20221103-1","C19_PR/22/00014-P02_L1_C19-20221103-1","C19_PR/22/00014-P03_L1_C19-20221103-1","C19_PR/22/00014-P04_L1_C19-20221103-1","C19_PR/22/00014-P05_L1_C19-20221103-1","C19_PR/22/00014-P06_L1_C19-20221103-1","",null,null,null,"C19_PR/22/00006","CENTRO DE ENSEÑANZA UNIVERSITARIA SEK","AF01",5,"Logística urbana inteligente de mercancías","C19_PR/22/00006-P01_L1_C19-20221014-1","AF1",750000,50000,null,"C19_PR/22/00042","Q0818003F",null,null,"C19_PR/22/00006-P01_L1_C19-20221014-1","Logística urbana inteligente de mercancías",{"$nulls":4},"C19_PR/22/00006-P01_L1_C19-20221014-1","AF01"]
["C19_PR/22/00016","UNIVERSIDAD DEL PAÍS VASCO_EUSKAL HERRIKO UNIBERTSITATEA","C19_PR/22/00016",null,null,"UNIVERSITAT POLITÈCNICA DE CATALUNYA",{"$nulls":5},"C19_PR/22/00042",{"$nulls":11},"C19_PR/22/00006-P01_L1_C19-20221014-1","AF01",6,"Logística urbana inteligente de mercancías","C19_PR/22/00006-P01_L1_C19-20221014-1",15,null,null,"C19_PR/22/00016","C19_PR/22/00016-P01_L1_C19-20221031-1","C19_PR/22/00016-P02_L1_C19-20221031-1","C19_PR/22/00016-P03_L1_C19-20221031-1","C19_PR/22/00016-P04_L1_C19-20221031-1","","","",null,null,null,"C19_PR/22/00006","CENTRO DE ENSEÑANZA UNIVERSITARIA SEK","AF01",6,"Logística urbana inteligente de mercancías","C19_PR/22/00006-P01_L1_C19-20221014-1","AF1",750000,50000,null,"C19_PR/22/00039","Q0818003F",null,null,"C19_PR/22/00006-P01_L1_C19-20221014-1","Logística urbana inteligente de mercancías",{"$nulls":4},"C19_PR/22/00006-P01_L1_C19-20221014-1","AF01"]
["C19_PR/22/00018","UNIVERSIDAD AUTÓNOMA DE MADRID","C19_PR/22/00018",null,null,"UNIVERSIDAD DEL PAÍS VASCO_EUSKAL HERRIKO UNIBERTSITATEA",{"$nulls":17},"C19_PR/22/00006-P01_L1_C19-20221014-1","AF01",7,"Logística urbana inteligente de mercancías","C19_PR/22/00006-P01_L1_C19-20221014-1",15,null,null,"C19_PR/22/00018","C19_PR/22/00018-P01_L1_C19-20221102-1","","","","","","",null,null,null,"C19_PR/22/00006","CENTRO DE ENSEÑANZA UNIVERSITARIA SEK","AF01",7,"Logística urbana inteligente de mercancías","C19_PR/22/00006-P01_L1_C19-20221014-1","AF1",750000,50000,null,"C19_PR/22/00027","Q3818001D",null,null,"C19_PR/22/00006-P01_L1_C19-20221014-1","Logística urbana inteligente de mercancías",{"$nulls":4},"C19_PR/22/00006-P01_L1_C19-20221014-1","AF01"]
["C19_PR/22/00020","UNIVERSIDAD DE CASTILLA LA MANCHA","C19_PR/22/00020",null,null,"UNIVERSIDAD AUTÓNOMA DE MADRID",{"$nulls":17},"C19_PR/22/00006-P01_L1_C19-20221014-1","AF01",8,"Logística urbana inteligente de mercancías","C19_PR/22/00006-P01_L1_C19-20221014-1",15,null,null,"C19_PR/22/00020","C19_PR/22/00020-P01_L1_C19-20221102-1","C19_PR/22/00020-P02_L1_C19-20221102-1","C19_PR/22/00020-P03_L1_C19-20221102-1","","","","",null,null,null,"C19_PR/22/00006","CENTRO DE ENSEÑANZA UNIVERSITARIA SEK","AF01",8,"Logística urbana inteligente de mercancías","C19_PR/22/00006-P01_L1_C19-20221014-1","AF1",750000,50000,null,"C19_PR/22/00026","Q2818015F",null,null,"C19_PR/22/00006-P01_L1_C19-20221014-1","Logística urbana inteligente de mercancías",{"$nulls":4},"C19_PR/22/00006-P01_L1_C19-20221014-1","AF01"]
["C19_PR/22/00022","UNIVERSIDAD POLITÉCNICA DE CARTAGENA","C19_PR/22/00022",null,null,"UNIVERSIDAD DE CASTILLA LA MANCHA",{"$nulls":17},"C19_PR/22/00006-P01_L1_C19-20221014-1","AF01",9,"Logística urbana inteligente de mercancías","C19_PR/22/00006-P01_L1_C19-20221014-1",15,null,null,"C19_PR/22/00022","C19_PR/22/00022-P01_L1_C19-20221101-1","","","","","","",null,null,null,"C19_PR/22/00006","CENTRO DE ENSEÑANZA UNIVERSITARIA SEK","AF01",9,"Logística urbana inteligente de mercancías","C19_PR/22/00006-P01_L1_C19-20221014-1","AF1",750000,50000,null,"C19_PR/22/00018","Q2818013A",null,null,"C19_PR/22/00006-P01_L1_C19-20221014-1","Logística urbana inteligente de mercancías",{"$nulls":4},"C19_PR/22/00006-P01_L1_C19-20221014-1","AF01"]
["C19_PR/22/00023","UNIVERSIDAD NACIONAL DE EDUCACIÓN A DISTANCIA","C19_PR/22/00023",null,null,"UNIVERSIDAD POLITÉCNICA DE CARTAGENA",{"$nulls":17},"C19_PR/22/00006-P01_L1_C19-20221014-1","AF01",10,"Logística urbana inteligente de mercancías","C19_PR/22/00006-P01_L1_C19-20221014-1",15,null,null,"C19_PR/22/00023","C19_PR/22/00023-P01_L1_C19-20221031-1","C19_PR/22/00023-P02_L1_C19-20221031-1","C19_PR/22/00023-P03_L1_C19-20221031-1","","","","",null,null,null,"C19_PR/22/00006","CENTRO DE ENSEÑANZA UNIVERSITARIA SEK","AF01",10,"Logística urbana inteligente de mercancías","C19_PR/22/00006-P01_L1_C19-20221014-1","AF1",750000,50000,null,"C19_PR/22/00029","Q1418001B",null,null,"C19_PR/22/00006-P01_L1_C19-20221014-1","Logística urbana inteligente de mercancías",{"$nulls":4},"C19_PR/22/00006-P01_L1_C19-20221014-1","AF01"]
["C19_PR/22/00024","UNIVERSIDAD POLITÉCNICA DE MADRID","C19_PR/22/00024",null,null,"UNIVERSIDAD NACIONAL DE EDUCACIÓN A DISTANCIA",{"$nulls":17},"C19_PR/22/00006-P01_L1_C19-20221014-1","AF01",11,"Logística urbana inteligente de mercancías","C19_PR/22/00006-P01_L1_C19-20221014-1",15,null,null,"C19_PR/22/00024","C19_PR/22/00024-P02_L1_C19-20221028-1","","","","","","",null,null,null,"C19_PR/22/00006","CENTRO DE ENSEÑANZA UNIVERSITARIA SEK","AF01",11,"Logística urbana inteligente de mercancías","C19_PR/22/00006-P01_L1_C19-20221014-1","AF1",750000,50000,null,"C19_PR/22/00014","Q0818003F",null,null,"C19_PR/22/00006-P01_L1_C19-20221014-1","Logística urbana inteligente de mercancías",{"$nulls":4},"C19_PR/22/00006-P01_L1_C19-20221014-1","AF01"]
["C19_PR/22/00026","UNIVERSIDAD POLITÉCNICA DE MADRID","C19_PR/22/00026",null,null,"UNIVERSIDAD POLITÉCNICA DE MADRID",{"$nulls":17},"C19_PR/22/00006-P01_L1_C19-20221014-1","AF01",12,"Logística urbana inteligente de mercancías","C19_PR/22/00006-P01_L1_C19-20221014-1",15,null,null,"C19_PR/22/00026","C19_PR/22/00026-P01_L1_C19-20221031-1","C19_PR/22/00026-P02_L1_C19-20221031-1","C19_PR/22/00026-P03_L1_C19-20221031-1","C19_PR/22/00026-P04_L1_C19-20221031-1","C19_PR/22/00026-P05_L1_C19-20221031-1","","",null,null,null,"C19_PR/22/00006","CENTRO DE ENSEÑANZA UNIVERSITARIA SEK","AF01",12,"Logística urbana inteligente de mercancías","C19_PR/22/00006-P01_L1_C19-20221014-1","AF1",750000,50000,null,"C19_PR/22/00040","Q0818003F",null,null,"C19_PR/22/00006-P01_L1_C19-20221014-1","Logística urbana inteligente de mercancías",{"$nulls":4},"C19_PR/22/00006-P01_L1_C19-20221014-1","AF01"]
["C19_PR/22/00027","UNIVERSIDAD DE LA LAGUNA","C19_PR/22/00027",null,null,"UNIVERSIDAD DE LA LAGUNA",{"$nulls":17},"C19_PR/22/00006-P01_L1_C19-20221014-1","AF01",13,"Logística urbana inteligente de mercancías","C19_PR/22/00006-P01_L1_C19-20221014-1",15,null,null,"C19_PR/22/00027","C19_PR/22/00027-P01_L1_C19-20221031-1","C19_PR/22/00027-P02_L1_C19-20221031-1","","","","","",null,null,null,"C19_PR/22/00006","CENTRO DE ENSEÑANZA UNIVERSITARIA SEK","AF01",13,"Logística urbana inteligente de mercancías","C19_PR/22/00006-P01_L1_C19-20221014-1","AF1",750000,50000,null,"C19_PR/22/00022","Q8050013E",null,null,"C19_PR/22/00006-P01_L1_C19-20221014-1","Logística urbana inteligente de mercancías",{"$nulls":4},"C19_PR/22/00006-P01_L1_C19-20221014-1","AF01"]
["C19_PR/22/00028","UNIVERSIDAD DE CANTABRIA","C19_PR/22/00028",null,null,"UNIVERSIDAD DE CORDOBA",{"$nulls":17},"C19_PR/22/00006-P01_L1_C19-20221014-1","AF01",14,"Logística urbana inteligente de mercancías","C19_PR/22/00006-P01_L1_C19-20221014-1",15,null,null,"C19_PR/22/00028","C19_PR/22/00028-P03_L1_C19-20221031-1","C19_PR/22/00028-P04_L1_C19-20221031-1","","","","","",null,null,null,"C19_PR/22/00006","CENTRO DE ENSEÑANZA UNIVERSITARIA SEK","AF01",14,"Logística urbana inteligente de mercancías","C19_PR/22/00006-P01_L1_C19-20221014-1","AF1",750000,50000,null,"C19_PR/22/00038","Q8650002B",null,null,"C19_PR/22/00006-P01_L1_C19-20221014-1","Logística urbana inteligente de mercancías",{"$nulls":4},"C19_PR/22/00006-P01_L1_C19-20221014-1","AF01"]
["C19_PR/22/00029","UNIVERSIDAD DE CORDOBA","C19_PR/22/00029",null,null,"UNIVERSIDAD DE HUELVA",{"$nulls":17},"C19_PR/22/00006-P01_L1_C19-20221014-1","AF01",15,"Logística urbana inteligente de mercancías","C19_PR/22/00006-P01_L1_C19-20221014-1",15,null,null,"C19_PR/22/00029","C19_PR/22/00029-P01_L1_C19-20221103-1","C19_PR/22/00029-P03_L1_C19-20221103-1","","","","","",null,null,null,"C19_PR/22/00006","CENTRO DE ENSEÑANZA UNIVERSITARIA SEK","AF01",15,"Logística urbana inteligente de mercancías","C19_PR/22/00006-P01_L1_C19-20221014-1","AF1",750000,50000,null,"C19_PR/22/00024","Q2818015F",null,null,"C19_PR/22/00006-P01_L1_C19-20221014-1","Logística urbana inteligente de mercancías",{"$nulls":4},"C19_PR/22/00006-P01_L1_C19-20221014-1","AF01"]
["C19_PR/22/00035","UNIVERSIDAD DE HUELVA","C19_PR/22/00035",null,null,"UNIVERSIDAD DE MURCIA",{"$nulls":17},"C19_PR/22/00006-P02_L1_C19-20221031-1","AF02",1,"Logística urbana inteligente de mercancías","C19_PR/22/00006-P02_L1_C19-20221031-1",15,null,null,"C19_PR/22/00035","C19_PR/22/00035-P01_L1_C19-20221103-1","","","","","","",null,null,null,"C19_PR/22/00006","CENTRO DE ENSEÑANZA UNIVERSITARIA SEK","AF02",1,"Logística urbana inteligente de mercancías","C19_PR/22/00006-P02_L1_C19-20221031-1","AF2",500000,50000,null,"C19_PR/22/00023","Q2818016D",null,null,"C19_PR/22/00006-P02_L1_C19-20221031-1","Logística urbana inteligente de mercancías",{"$nulls":4},"C19_PR/22/00006-P02_L1_C19-20221031-1","AF02"]
["C19_PR/22/00036","UNIVERSIDAD DE MURCIA","C19_PR/22/00036",null,null,"UNIVERSIDAD INTERNACIONAL ISABEL I DE CASTILLA",{"$nulls":17},"C19_PR/22/00006-P02_L1_C19-20221031-1","AF02",2,"Logística urbana inteligente de mercancías","C19_PR/22/00006-P02_L1_C19-20221031-1",15,null,null,"C19_PR/22/00036","C19_PR/22/00036-P01_L1_C19-20221103-1","C19_PR/22/00036-P03_L1_C19-20221103-1","","","","","",null,null,null,"C19_PR/22/00006","CENTRO DE ENSEÑANZA UNIVERSITARIA SEK","AF02",2,"Logística urbana inteligente de mercancías","C19_PR/22/00006-P02_L1_C19-20221031-1","AF2",500000,50000,null,"C19_PR/22/00035","Q7150008F",null,null,"C19_PR/22/00006-P02_L1_C19-20221031-1","Logística urbana inteligente de mercancías",{"$nulls":4},"C19_PR/22/00006-P02_L1_C19-20221031-1","AF02"]
["C19_PR/22/00038","UNIVERSIDADE DE VIGO","C19_PR/22/00038",{"$nulls":20},"C19_PR/22/00006-P02_L1_C19-20221031-1","AF02",3,"Logística urbana inteligente de mercancías","C19_PR/22/00006-P02_L1_C19-20221031-1",15,null,null,"C19_PR/22/00038","C19_PR/22/00038-P01_L1_C19-20221103-1","C19_PR/22/00038-P03_L1_C19-20221103-1","","","","","",null,null,null,"C19_PR/22/00006","CENTRO DE ENSEÑANZA UNIVERSITARIA SEK","AF02",3,"Logística urbana inteligente de mercancías","C19_PR/22/00006-P02_L1_C19-20221031-1","AF2",500000,50000,null,"C19_PR/22/00016","Q4818001B",null,null,"C19_PR/22/00006-P02_L1_C19-20221031-1","Logística urbana inteligente de mercancías",{"$nulls":4},"C19_PR/22/00006-P02_L1_C19-20221031-1","AF02"]
["C19_PR/22/00039","UNIVERSITAT POLITÈCNICA DE CATALUNYA","C19_PR/22/00039",{"$nulls":20},"C19_PR/22/00006-P02_L1_C19-20221031-1","AF02",4,"Logística urbana inteligente de mercancías","C19_PR/22/00006-P02_L1_C19-20221031-1",15,null,null,"C19_PR/22/00039","C19_PR/22/00039-P01_L1_C19-20221103-1","C19_PR/22/00039-P02_L1_C19-20221103-1","C19_PR/22/00039-P03_L1_C19-20221103-1","C19_PR/22/00039-P04_L1_C19-20221103-1","C19_PR/22/00039-P05_L1_C19-20221103-1","C19_PR/22/00039-P06_L1_C19-20221103-1","",null,null,null,"C19_PR/22/00006","CENTRO DE ENSEÑANZA UNIVERSITARIA SEK","AF02",4,"Logística urbana inteligente de mercancías","C19_PR/22/00006-P02_L1_C19-20221031-1","AF2",500000,50000,null,"C19_PR/22/00009","Q3918001C",null,null,"C19_PR/22/00006-P02_L1_C19-20221031-1","Logística urbana inteligente de mercancías",{"$nulls":4},"C19_PR/22/00006-P02_L1_C19-20221031-1","AF02"]
["C19_PR/22/00040","UNIVERSITAT POLITÈCNICA DE CATALUNYA","C19_PR/22/00040",{"$nulls":20},"C19_PR/22/00006-P02_L1_C19-20221031-1","AF02",5,"Logística urbana inteligente de mercancías","C19_PR/22/00006-P02_L1_C19-20221031-1",15,null,null,"C19_PR/22/00040","C19_PR/22/00040-P03_L1_C19-20221103-1","","","","","","",null,null,null,"C19_PR/22/00006","CENTRO DE ENSEÑANZA UNIVERSITARIA SEK","AF02",5,"Logística urbana inteligente de mercancías","C19_PR/22/00006-P02_L1_C19-20221031-1","AF2",500000,50000,null,"C19_PR/22/00036","Q3018001B",null,null,"C19_PR/22/00006-P02_L1_C19-20221031-1","Logística urbana inteligente de mercancías",{"$nulls":4},"C19_PR/22/00006-P02_L1_C19-20221031-1","AF02"]
["C19_PR/22/00041","UNIVERSIDAD INTERNACIONAL ISABEL I DE CASTILLA","C19_PR/22/00041",{"$nulls":20},"C19_PR/22/00006-P02_L1_C19-20221031-1","AF02",6,"Logística urbana inteligente de mercancías","C19_PR/22/00006-P02_L1_C19-20221031-1",15,null,null,"C19_PR/22/00041","C19_PR/22/00041-P01_L1_C19-20221103-1","C19_PR/22/00041-P03_L1_C19-20221103-1","C19_PR/22/00041-P03_L1_C19-20221103-2","C19_PR/22/00041-P06_L1_C19-20221103-1","C19_PR/22/00041-P02_L1_C19-20221103-2","C19_PR/22/00041-P03_L1_C19-20221103-3","",null,null,null,"C19_PR/22/00006","CENTRO DE ENSEÑANZA UNIVERSITARIA SEK","AF02",6,"Logística urbana inteligente de mercancías","C19_PR/22/00006-P02_L1_C19-20221031-1","AF2",500000,50000,null,"C19_PR/22/00028","Q3918001C",null,null,"C19_PR/22/00006-P02_L1_C19-20221031-1","Logística urbana inteligente de mercancías",{"$nulls":4},"C19_PR/22/00006-P02_L1_C19-20221031-1","AF02"]
["C19_PR/22/00042","UNIVERSITAT POLITÈCNICA DE CATALUNYA","C19_PR/22/00042",{"$nulls":20},"C19_PR/22/00006-P02_L1_C19-20221031-1","AF02",7,"Logística urbana inteligente de mercancías","C19_PR/22/00006-P02_L1_C19-20221031-1",15,null,null,"C19_PR/22/00042","C19_PR/22/00042-P01_L1_C19-20221103-1","","","","","","",null,null,null,"C19_PR/22/00006","CENTRO DE ENSEÑANZA UNIVERSITARIA SEK","AF02",7,"Logística urbana inteligente de mercancías","C19_PR/22/00006-P02_L1_C19-20221031-1","AF2",500000,50000,null,"C19_PR/22/00041","A09515412",null,null,"C19_PR/22/00006-P02_L1_C19-20221031-1","Logística urbana inteligente de mercancías",{"$nulls":4},"C19_PR/22/00006-P02_L1_C19-20221031-1","AF02"]
[{"$nulls":23},"C19_PR/22/00006-P02_L1_C19-20221031-1","AF02",8,"Logística urbana inteligente de mercancías","C19_PR/22/00006-P02_L1_C19-20221031-1",15,{"$nulls":13},"C19_PR/22/00006","CENTRO DE ENSEÑANZA UNIVERSITARIA SEK","AF02",8,"Logística urbana inteligente de mercancías","C19_PR/22/00006-P02_L1_C19-20221031-1","AF2",500000,50000,{"$nulls":5},"C19_PR/22/00006-P02_L1_C19-20221031-1","Logística urbana inteligente de mercancías",{"$nulls":4},"C19_PR/22/00006-P02_L1_C19-20221031-1","AF02"]
[{"$nulls":23},"C19_PR/22/00006-P02_L1_C19-20221031-1","AF02",9,"Logística urbana inteligente de mercancías","C19_PR/22/00006-P02_L1_C19-20221031-1",15,{"$nulls":13},"C19_PR/22/00006","CENTRO DE ENSEÑANZA UNIVERSITARIA SEK","AF02",9,"Logística urbana inteligente de mercancías","C19_PR/22/00006-P02_L1_C19-20221031-1","AF2",500000,50000,{"$nulls":5},"C19_PR/22/00006-P02_L1_C19-20221031-1","Logística urbana inteligente de mercancías",{"$nulls":4},"C19_PR/22/00006-P02_L1_C19-20221031-1","AF02"]
[{"$nulls":23},"C19_PR/22/00006-P02_L1_C19-20221031-1","AF02",10,"Logística urbana inteligente de mercancías","C19_PR/22/00006-P02_L1_C19-20221031-1",15,{"$nulls":13},"C19_PR/22/00006","CENTRO DE ENSEÑANZA UNIVERSITARIA SEK","AF02",10,"Logística urbana inteligente de mercancías","C19_PR/22/00006-P02_L1_C19-20221031-1","AF2",500000,50000,{"$nulls":5},"C19_PR/22/00006-P02_L1_C19-20221031-1","Logística urbana inteligente de mercancías",{"$nulls":4},"C19_PR/22/00006-P02_L1_C19-20221031-1","AF02"]
[{"$nulls":23},"C19_PR/22/00006-P03_L1_C19-20221102-1","AF03",1,"Industria 4.0 aplicado a la industria aeronáutica y del transporte","C19_PR/22/00006-P03_L1_C19-20221102-1",15,{"$nulls":13},"C19_PR/22/00006","CENTRO DE ENSEÑANZA UNIVERSITARIA SEK","AF03",1,"Industria 4.0 aplicado a la industria aeronáutica y del transporte","C19_PR/22/00006-P03_L1_C19-20221102-1","AF3",200000,50000,{"$nulls":5},"C19_PR/22/00006-P03_L1_C19-20221102-1","Industria 4.0 aplicado a la industria aeronáutica y del transporte",{"$nulls":4},"C19_PR/22/00006-P03_L1_C19-20221102-1","AF03"]
[{"$nulls":23},"C19_PR/22/00006-P03_L1_C19-20221102-1","AF03",2,"Industria 4.0 aplicado a la industria aeronáutica y del transporte","C19_PR/22/00006-P03_L1_C19-20221102-1",15,{"$nulls":13},"C19_PR/22/00006","CENTRO DE ENSEÑANZA UNIVERSITARIA SEK","AF03",2,"Industria 4.0 aplicado a la industria aeronáutica y del transporte","C19_PR/22/00006-P03_L1_C19-20221102-1","AF3",200000,50000,{"$nulls":5},"C19_PR/22/00006-P03_L1_C19-20221102-1","Industria 4.0 aplicado a la industria aeronáutica y del transporte",{"$nulls":4},"C19_PR/22/00006-P03_L1_C19-20221102-1","AF03"]
[{"$nulls":23},"C19_PR/22/00006-P03_L1_C19-20221102-1","AF03",3,"Industria 4.0 aplicado a la industria aeronáutica y del transporte","C19_PR/22/00006-P03_L1_C19-20221102-1",15,{"$nulls":13},"C19_PR/22/00006","CENTRO DE ENSEÑANZA UNIVERSITARIA SEK","AF03",3,"Industria 4.0 aplicado a la industria aeronáutica y del transporte","C19_PR/22/00006-P03_L1_C19-20221102-1","AF3",200000,50000,{"$nulls":5},"C19_PR/22/00006-P03_L1_C19-20221102-1","Industria 4.0 aplicado a la industria aeronáutica y del transporte",{"$nulls":4},"C19_PR/22/00006-P03_L1_C19-20221102-1","AF03"]
[{"$nulls":23},"C19_PR/22/00006-P03_L1_C19-20221102-1","AF03",4,"Industria 4.0 aplicado a la industria aeronáutica y del transporte","C19_PR/22/00006-P03_L1_C19-20221102-1",15,{"$nulls":13},"C19_PR/22/00006","CENTRO DE ENSEÑANZA UNIVERSITARIA SEK","AF03",4,"Industria 4.0 aplicado a la industria aeronáutica y del transporte","C19_PR/22/00006-P03_L1_C19-20221102-1","AF3",200000,50000,{"$nulls":5},"C19_PR/22/00006-P03_L1_C19-20221102-1","Industria 4.0 aplicado a la industria aeronáutica y del transporte",{"$nulls":4},"C19_PR/22/00006-P03_L1_C19-20221102-1","AF03"]
{"$rows_left_out":191}
{"sheet":"Desplegables","index":2,"n_rows":22,"n_cols":7,"rows_kept":22,"cut":false,"hidden":true,"merged":[]}
[]
[]
[]
[]
["Hombre","Sí","Universidad","Acrónimo","CIF Universidad",null,"Plataforma aula virtual"]
["Mujer","No","Seleccione el nombre de la Universidad",null,null,null,"Seguros"]
[null,null,"CENTRO DE ENSEÑANZA UNIVERSITARIA SEK","IE","A79336947",null,"Publicidad y difusión"]
[1,null,"UNIVERSIDAD AUTÓNOMA DE MADRID","UAM","Q2818013A",null,"Gestión y dirección"]
[2,null,"UNIVERSIDAD DE ALCALA DE HENÁRES","UAH","Q2818018J",null,"Gastos generales"]
[3,null,"UNIVERSIDAD DE CANTABRIA","UNICAN","Q3918001C",null,"Gastos de avales y/o fianzas"]
[4,null,"UNIVERSIDAD DE CASTILLA LA MANCHA","UCLM","Q1368009E",null,"Gasto no subvencionable"]
[5,null,"UNIVERSIDAD DE CORDOBA","UCO","Q1418001B"]
[6,null,"UNIVERSIDAD DE HUELVA","UHU","Q7150008F"]
[7,null,"UNIVERSIDAD DE LA LAGUNA","ULL","Q3818001D"]
[8,null,"UNIVERSIDAD DE MURCIA","UM","Q3018001B"]
[9,null,"UNIVERSIDAD DEL PAÍS VASCO_EUSKAL HERRIKO UNIBERTSITATEA","EHU","Q4818001B"]
[10,null,"UNIVERSIDAD INTERNACIONAL ISABEL I DE CASTILLA","UI1","A09515412"]
[11,null,"UNIVERSIDAD NACIONAL DE EDUCACIÓN A DISTANCIA","UNED","Q2818016D"]
[12,null,"UNIVERSIDAD POLITÉCNICA DE CARTAGENA","UPTC","Q8050013E"]
[13,null,"UNIVERSIDAD POLITÉCNICA DE MADRID","UPM","Q2818015F"]
[14,null,"UNIVERSIDADE DE VIGO","UVIGO","Q8650002B"]
[15,null,"UNIVERSITAT POLITÈCNICA DE CATALUNYA","UPC","Q0818003F"]

{"sheet":"Hoja1","index":3,"n_rows":0,"n_cols":0,"rows_kept":0,"cut":false,"hidden":true,"merged":[]}